Проблемы с установкой драйвера

Эта ветка закрыта для дальнейших ответов. Вы можете создать новую тему, чтобы поделиться своими идеями или задать вопросы.

Проблемы с установкой драйвера

Эта ветка закрыта для дальнейших ответов. Вы можете создать новую тему, чтобы поделиться своими идеями или задать вопросы.
Проблемы с установкой драйвера
Проблемы с установкой драйвера
2011-06-07 12:31:22
Если при установки драйвера, Вы столкнулись с проблемами, пожалуйста заполните следующую форму перед обращением:

1. Hardware версия устройства (посмотреть можно в статусе, либо на коробке)
2. Ваша операционная система (WIN XP/Vista/7, Linux, Mac OS)
3. Версия драйвера, который вы пытаетесь установить (если с диска, пишем "с диска")
4. Антивирусные программы и фаерволлы (перечислить установленные)
5. Максимально подробно описать ваши действия при установки и самой проблемы


Первичные сообщения без данной формы не рассматриваются и удаляются, а авторам выносятся предупреждения.
  0      
  0      
#1
Опции
5 Ответить
Re: Проблемы с установкой драйвера
2011-10-31 14:43:30
1. Hardware 3.2
2. WIN 7
3. "С диска" и с сайта http://www.tp-linkru.com TG-3269_100628
4. Антивирус Kaspersky Crystal
5. Сетевая карта не хочет принимать драйвера которые шли с диском \ либо скачанные с сайта. Зайдя в диспетчер устройств - выходит неизвестное устройство "Контролеры запоминающих устройств" - При выборе обновления в Автоматическом режиме - пишет драйвер не найден, и точно также если я выбираю вручную обновление и указываю путь к драйверам на диск либо на папку с драйверами окаченных с интернета.
  0  
  0  
#1
Опции
Re: Проблемы с установкой драйвера
2011-11-01 10:07:24
[quote="maksim_kms"]1. Hardware 3.2
2. WIN 7
3. "С диска" и с сайта http://www.tp-linkru.com TG-3269_100628
4. Антивирус Kaspersky Crystal
5. Сетевая карта не хочет принимать драйвера которые шли с диском \ либо скачанные с сайта. Зайдя в диспетчер устройств - выходит неизвестное устройство "Контролеры запоминающих устройств" - При выборе обновления в Автоматическом режиме - пишет драйвер не найден, и точно также если я выбираю вручную обновление и указываю путь к драйверам на диск либо на папку с драйверами окаченных с интернета.[/quote]
Удалите и поставьте заново драйвера в безопасном режиме.
  0  
  0  
#1
Опции
Re: Проблемы с установкой драйвера
2017-11-30 00:37:08
1. Ver: 3.3, S/N:135A2106864
2. Linux (3.14.22-nrj-desktop-3rosa)
3. TG-3269_V3_100628.zip ()
4. iptables
5.

$ make make -C src/ clean make[1]: вход в каталог «/home/myuser/drivers/Linux/src» rm -f *.o *.ko *~ core* .dep* .*.d .*.cmd *.mod.c *.a *.s .*.flags make[1]: выход из каталога «/home/myuser/drivers/Linux/src» make -C src/ modules make[1]: вход в каталог «/home/myuser/drivers/Linux/src» make -C /lib/modules/3.14.22-nrj-desktop-3rosa/build SUBDIRS=/home/myuser/drivers/Linux/src modules make[2]: вход в каталог «/usr/src/linux-3.14.22-nrj-desktop-3rosa» CC [M] /home/myuser/drivers/Linux/src/r1000_n.o /home/myuser/drivers/Linux/src/r1000_n.c:156:45: ошибка: expected «=», «,», «;», «asm» or «__attribute__» before «__devinitdata» static struct pci_device_id r1000_pci_tbl[] __devinitdata = { ^ /home/myuser/drivers/Linux/src/r1000_n.c:378:21: ошибка: expected «)» before string constant MODULE_PARM (media, "1-" __MODULE_STRING(MAX_UNITS) "i"); ^ /home/myuser/drivers/Linux/src/r1000_n.c: В функции «r1000_phy_timer_t_handler»: /home/myuser/drivers/Linux/src/r1000_n.c:525:60: ошибка: «struct net_device» не содержит элемента с именем «priv» struct r1000_private *priv = (struct r1000_private *) (dev->priv); ^ /home/myuser/drivers/Linux/src/r1000_n.c: В функции «r1000_timer_handler»: /home/myuser/drivers/Linux/src/r1000_n.c:561:60: ошибка: «struct net_device» не содержит элемента с именем «priv» struct r1000_private *priv = (struct r1000_private *) (dev->priv); ^ /home/myuser/drivers/Linux/src/r1000_n.c: На верхнем уровне: /home/myuser/drivers/Linux/src/r1000_n.c:587:22: ошибка: expected «=», «,», «;», «asm» or «__attribute__» before «r1000_init_board» static int __devinit r1000_init_board ( struct pci_dev *pdev, struct net_device **dev_out, unsigned long *ioaddr_out) ^ /home/myuser/drivers/Linux/src/r1000_n.c:761:22: ошибка: expected «=», «,», «;», «asm» or «__attribute__» before «r1000_init_one» static int __devinit r1000_init_one (struct pci_dev *pdev, const struct pci_device_id *ent) ^ /home/myuser/drivers/Linux/src/r1000_n.c:1019:23: ошибка: expected «=», «,», «;», «asm» or «__attribute__» before «r1000_remove_one» static void __devexit r1000_remove_one (struct pci_dev *pdev) ^ /home/myuser/drivers/Linux/src/r1000_n.c: В функции «r1000_open»: /home/myuser/drivers/Linux/src/r1000_n.c:1052:34: ошибка: «struct net_device» не содержит элемента с именем «priv» struct r1000_private *priv = dev->priv; ^ /home/myuser/drivers/Linux/src/r1000_n.c:1064:2: ошибка: неявная декларация функции «request_irq» [-Werror=implicit-function-declaration] retval = request_irq (dev->irq, r1000_interrupt, SA_SHIRQ, dev->name, dev); ^ /home/myuser/drivers/Linux/src/r1000_n.c:1064:51: ошибка: «SA_SHIRQ» undeclared (first use in this function) retval = request_irq (dev->irq, r1000_interrupt, SA_SHIRQ, dev->name, dev); ^ /home/myuser/drivers/Linux/src/r1000_n.c:1064:51: замечание: each undeclared identifier is reported only once for each function it appears in /home/myuser/drivers/Linux/src/r1000_n.c: В функции «r1000_hw_PHY_reset»: /home/myuser/drivers/Linux/src/r1000_n.c:1140:34: ошибка: «struct net_device» не содержит элемента с именем «priv» struct r1000_private *priv = dev->priv; ^ /home/myuser/drivers/Linux/src/r1000_n.c: В функции «r1000_hw_PHY_config»: /home/myuser/drivers/Linux/src/r1000_n.c:1168:34: ошибка: «struct net_device» не содержит элемента с именем «priv» struct r1000_private *priv = dev->priv; ^ /home/myuser/drivers/Linux/src/r1000_n.c: В функции «r1000_hw_start»: /home/myuser/drivers/Linux/src/r1000_n.c:1244:34: ошибка: «struct net_device» не содержит элемента с именем «priv» struct r1000_private *priv = dev->priv; ^ /home/myuser/drivers/Linux/src/r1000_n.c: В функции «r1000_init_ring»: /home/myuser/drivers/Linux/src/r1000_n.c:1399:34: ошибка: «struct net_device» не содержит элемента с именем «priv» struct r1000_private *priv = dev->priv; ^ /home/myuser/drivers/Linux/src/r1000_n.c: В функции «r1000_tx_timeout»: /home/myuser/drivers/Linux/src/r1000_n.c:1475:34: ошибка: «struct net_device» не содержит элемента с именем «priv» struct r1000_private *priv = dev->priv; ^ /home/myuser/drivers/Linux/src/r1000_n.c: В функции «r1000_start_xmit»: /home/myuser/drivers/Linux/src/r1000_n.c:1508:34: ошибка: «struct net_device» не содержит элемента с именем «priv» struct r1000_private *priv = dev->priv; ^ /home/myuser/drivers/Linux/src/r1000_n.c: В функции «r1000_interrupt»: /home/myuser/drivers/Linux/src/r1000_n.c:1749:34: ошибка: «struct net_device» не содержит элемента с именем «priv» struct r1000_private *priv = dev->priv; ^ /home/myuser/drivers/Linux/src/r1000_n.c: В функции «r1000_close»: /home/myuser/drivers/Linux/src/r1000_n.c:1812:34: ошибка: «struct net_device» не содержит элемента с именем «priv» struct r1000_private *priv = dev->priv; ^ /home/myuser/drivers/Linux/src/r1000_n.c:1841:2: ошибка: неявная декларация функции «free_irq» [-Werror=implicit-function-declaration] free_irq (dev->irq, dev); ^ /home/myuser/drivers/Linux/src/r1000_n.c: В функции «r1000_set_rx_mode»: /home/myuser/drivers/Linux/src/r1000_n.c:1914:34: ошибка: «struct net_device» не содержит элемента с именем «priv» struct r1000_private *priv = dev->priv; ^ /home/myuser/drivers/Linux/src/r1000_n.c:1927:17: ошибка: «struct net_device» не содержит элемента с именем «mc_count» } else if ((dev->mc_count > multicast_filter_limit) || (dev->flags & IFF_ALLMULTI)) { ^ /home/myuser/drivers/Linux/src/r1000_n.c:1941:27: ошибка: «struct net_device» не содержит элемента с именем «mc_list» for (i = 0, mclist = dev->mc_list; mclist && i < dev->mc_count; i++, mclist = mclist->next) ^ /home/myuser/drivers/Linux/src/r1000_n.c:1941:55: ошибка: «struct net_device» не содержит элемента с именем «mc_count» for (i = 0, mclist = dev->mc_list; mclist && i < dev->mc_count; i++, mclist = mclist->next) ^ /home/myuser/drivers/Linux/src/r1000_n.c:1941:87: ошибка: доступ по указателю на неполный тип for (i = 0, mclist = dev->mc_list; mclist && i < dev->mc_count; i++, mclist = mclist->next) ^ /home/myuser/drivers/Linux/src/r1000_n.c:1943:43: ошибка: доступ по указателю на неполный тип int bit_nr = ether_crc(ETH_ALEN, mclist->dmi_addr) >> 26; ^ /home/myuser/drivers/Linux/src/r1000_n.c: В функции «r1000_get_stats»: /home/myuser/drivers/Linux/src/r1000_n.c:1980:34: ошибка: «struct net_device» не содержит элемента с именем «priv» struct r1000_private *priv = dev->priv; ^ /home/myuser/drivers/Linux/src/r1000_n.c: На верхнем уровне: /home/myuser/drivers/Linux/src/r1000_n.c:1995:12: ошибка: «r1000_pci_tbl» undeclared here (not in a function) id_table: r1000_pci_tbl, ^ /home/myuser/drivers/Linux/src/r1000_n.c:1996:10: ошибка: «r1000_init_one» undeclared here (not in a function) probe: r1000_init_one, ^ /home/myuser/drivers/Linux/src/r1000_n.c:1997:11: ошибка: «r1000_remove_one» undeclared here (not in a function) remove: r1000_remove_one, ^ /home/myuser/drivers/Linux/src/r1000_n.c: В функции «r1000_init_module»: /home/myuser/drivers/Linux/src/r1000_n.c:2009:2: ошибка: неявная декларация функции «pci_module_init» [-Werror=implicit-function-declaration] return pci_module_init (&r1000_pci_driver); // pci_register_driver (drv) ^ /home/myuser/drivers/Linux/src/r1000_n.c: На верхнем уровне: /home/myuser/drivers/Linux/src/r1000_n.c:48:12: предупреждение: «media» определена, но нигде не используется [-Wunused-variable] static int media[MAX_UNITS] = {-1, -1, -1, -1, -1, -1, -1, -1}; ^ /home/myuser/drivers/Linux/src/r1000_n.c:1050:12: предупреждение: «r1000_open» определена, но нигде не используется [-Wunused-function] static int r1000_open (struct net_device *dev) ^ /home/myuser/drivers/Linux/src/r1000_n.c:1506:12: предупреждение: «r1000_start_xmit» определена, но нигде не используется [-Wunused-function] static int r1000_start_xmit (struct sk_buff *skb, struct net_device *dev) ^ /home/myuser/drivers/Linux/src/r1000_n.c:1810:12: предупреждение: «r1000_close» определена, но нигде не используется [-Wunused-function] static int r1000_close (struct net_device *dev) ^ /home/myuser/drivers/Linux/src/r1000_n.c:1473:13: предупреждение: «r1000_tx_timeout» определена, но нигде не используется [-Wunused-function] static void r1000_tx_timeout (struct net_device *dev) ^ /home/myuser/drivers/Linux/src/r1000_n.c:1977:26: предупреждение: «r1000_get_stats» определена, но нигде не используется [-Wunused-function] struct net_device_stats *r1000_get_stats(struct net_device *dev) ^ /home/myuser/drivers/Linux/src/r1000_n.c:1166:13: предупреждение: «r1000_hw_PHY_config» определена, но нигде не используется [-Wunused-function] static void r1000_hw_PHY_config (struct net_device *dev) ^ In file included from /home/myuser/drivers/Linux/src/r1000_n.c:6:0: include/linux/module.h:138:40: ошибка: «__mod_pci__r1000_pci_tbl_device_table» aliased to undefined symbol «r1000_pci_tbl» extern const struct type##_device_id __mod_##type##__##name##_device_table \ ^ /home/myuser/drivers/Linux/src/r1000_n.c:165:1: замечание: in expansion of macro «MODULE_DEVICE_TABLE» MODULE_DEVICE_TABLE (pci, r1000_pci_tbl); ^ cc1: some warnings being treated as errors scripts/Makefile.build:308: ошибка выполнения рецепта для цели «/home/myuser/drivers/Linux/src/r1000_n.o» make[3]: *** [/home/myuser/drivers/Linux/src/r1000_n.o] Ошибка 1 Makefile:1278: ошибка выполнения рецепта для цели «_module_/home/myuser/drivers/Linux/src» make[2]: *** [_module_/home/myuser/drivers/Linux/src] Ошибка 2 make[2]: выход из каталога «/usr/src/linux-3.14.22-nrj-desktop-3rosa» Makefile:15: ошибка выполнения рецепта для цели «modules» make[1]: *** [modules] Ошибка 2 make[1]: выход из каталога «/home/myuser/drivers/Linux/src» Makefile:8: ошибка выполнения рецепта для цели «modules» make: *** [modules] Ошибка 2
  0  
  0  
#1
Опции
Re: Проблемы с установкой драйвера
2017-11-30 08:02:02
Вы же видели наверняка в архиве, что драйвера под Linux-2.4.x & Linux-2.6.x
Воспользуйтесь командой что бы узнать чип, и скачайте подходящий пакет из репозитория или с сайта производителя чипсета.
  0  
  0  
#1
Опции
Re: Проблемы с установкой драйвера
2017-11-30 08:51:13
Да, видел. Просто на сколько я помню, переход с 2.6 на 3.x был условным. Ничего кардинального не поменялось, в отличии от перехода 2.4 на 2.6. Хорошо, попробую.
  0  
  0  
#1
Опции

Информация

Поблагодарили: 0

Просмотры: 4424

Ответы: 5

Статьи по теме